Building AOSP on OS X 10.11 El Capitan
Tyler Freeman

I got this error: xcode-select: error: invalid developer directory ‘/Developer’ when running `sudo xcode-select -s /Developer`

And other error is

system/core/libutils/Printer.cpp:119: error: ‘dprintf’ was not declared in this scope

make: *** [out/host/darwin-x86/obj32/STATIC_LIBRARIES/libutils_intermediates/Printer.o] Error 1

How could I fix these problems?

One clap, two clap, three clap, forty?

By clapping more or less, you can signal to us which stories really stand out.